Target
P2X purinoceptor 7
Ligand
BDBM174774
Substrate
Meas. Tech.
P2X7 FLIPR Assay
pH
7.4±n/a
IC50
63.4±n/a nM
Comments
extracted
Citation
 Letavic, MARudolph, DA P2X7 modulators US Patent  US10053462 Publication Date 8/21/2018 
Target
Name:
P2X purinoceptor 7
Synonyms:
ATP receptor P2RX7_HUMAN P2X purinoceptor 7 (P2X7) P2Z receptor | Purinergic receptor
Type:
Protein
Mol. Mass.:
68602.85
Organism:
Homo sapiens (Human)
Description:
Q99572
Residue:
595
  
Inhibitor
Name:
BDBM174774
Synonyms:
US10053462, 5 US9540388, 5
Type:
Small organic molecule
Emp. Form.:
C22H17ClF4N4O
Mol. Mass.:
464.843
SMILES:
Fc1ccc(cc1)-c1nnc2[C@H]3CCC[C@@H](Cn12)N3C(=O)c1cccc(c1Cl)C(F)(F)F
: