Target
P2X purinoceptor 7
Ligand
BDBM174781
Substrate
Meas. Tech.
P2X7 Radioligand Binding Assay
Ki
12.6±n/a nM
Citation
 Letavic, MARudolph, DA P2X7 modulators US Patent  US10053462 Publication Date 8/21/2018 
Target
Name:
P2X purinoceptor 7
Synonyms:
ATP receptor P2RX7_HUMAN P2X purinoceptor 7 (P2X7) P2Z receptor | Purinergic receptor
Type:
Protein
Mol. Mass.:
68602.85
Organism:
Homo sapiens (Human)
Description:
Q99572
Residue:
595
  
Inhibitor
Name:
BDBM174781
Synonyms:
US10053462, 12 US9540388, 12
Type:
Small organic molecule
Emp. Form.:
C21H16ClF4N5O
Mol. Mass.:
465.831
SMILES:
Fc1ccc(nc1)-c1nnc2[C@@H]3CCC[C@H](Cn12)N3C(=O)c1cccc(c1Cl)C(F)(F)F
: