Target
P2X purinoceptor 7
Ligand
BDBM174805
Substrate
Meas. Tech.
P2X7 FLIPR Assay
pH
7.4±n/a
IC50
338±n/a nM
Comments
extracted
Citation
 Letavic, MARudolph, DA P2X7 modulators US Patent  US10053462 Publication Date 8/21/2018 
Target
Name:
P2X purinoceptor 7
Synonyms:
P2RX7_MOUSE P2x7
Type:
PROTEIN
Mol. Mass.:
68405.16
Organism:
Mus musculus
Description:
ChEMBL_1473824
Residue:
595
  
Inhibitor
Name:
BDBM174805
Synonyms:
US10053462, 36 US9540388, 36
Type:
Small organic molecule
Emp. Form.:
C19H15ClF3N5OS
Mol. Mass.:
453.869
SMILES:
FC(F)(F)c1nccc(C(=O)N2[C@@H]3CCC[C@H]2c2nnc(-c4cccs4)n2C3)c1Cl
: