Target
P2X purinoceptor 7
Ligand
BDBM174810
Substrate
Meas. Tech.
P2X7 Radioligand Binding Assay
Ki
7.90±n/a nM
Citation
 Letavic, MARudolph, DA P2X7 modulators US Patent  US10053462 Publication Date 8/21/2018 
Target
Name:
P2X purinoceptor 7
Synonyms:
P2RX7_MOUSE P2x7
Type:
PROTEIN
Mol. Mass.:
68405.16
Organism:
Mus musculus
Description:
ChEMBL_1473824
Residue:
595
  
Inhibitor
Name:
BDBM174810
Synonyms:
US10053462, 41 US9540388, 41
Type:
Small organic molecule
Emp. Form.:
C20H15ClF3N5O
Mol. Mass.:
433.814
SMILES:
FC(F)(F)c1cccc(C(=O)N2[C@H]3CC[C@@H]2c2nnc(-c4ccccn4)n2C3)c1Cl
: