Target
P2X purinoceptor 7
Ligand
BDBM174813
Substrate
Meas. Tech.
P2X7 FLIPR Assay
pH
7.4±n/a
IC50
7.70±n/a nM
Comments
extracted
Citation
 Letavic, MARudolph, DA P2X7 modulators US Patent  US10053462 Publication Date 8/21/2018 
Target
Name:
P2X purinoceptor 7
Synonyms:
ATP receptor P2RX7_HUMAN P2X purinoceptor 7 (P2X7) P2Z receptor | Purinergic receptor
Type:
Protein
Mol. Mass.:
68602.85
Organism:
Homo sapiens (Human)
Description:
Q99572
Residue:
595
  
Inhibitor
Name:
BDBM174813
Synonyms:
US10053462, 44 US9540388, 44
Type:
Small organic molecule
Emp. Form.:
C21H18F3N5O
Mol. Mass.:
413.3957
SMILES:
Cc1c(cccc1C(F)(F)F)C(=O)N1[C@H]2CC[C@@H]1c1nnc(-c3ccccn3)n1C2
: