Target
P2X purinoceptor 7
Ligand
BDBM174820
Substrate
Meas. Tech.
P2X7 FLIPR Assay
pH
7.4±n/a
IC50
4102±n/a nM
Comments
extracted
Citation
 Letavic, MARudolph, DA P2X7 modulators US Patent  US10053462 Publication Date 8/21/2018 
Target
Name:
P2X purinoceptor 7
Synonyms:
P2RX7_MOUSE P2x7
Type:
PROTEIN
Mol. Mass.:
68405.16
Organism:
Mus musculus
Description:
ChEMBL_1473824
Residue:
595
  
Inhibitor
Name:
BDBM174820
Synonyms:
US10053462, 51 US9540388, 51
Type:
Small organic molecule
Emp. Form.:
C19H16ClF3N6O
Mol. Mass.:
436.818
SMILES:
Cc1cc([nH]n1)-c1nnc2[C@H]3CC[C@@H](Cn12)N3C(=O)c1cccc(c1Cl)C(F)(F)F
: