Target
P2X purinoceptor 7
Ligand
BDBM174822
Substrate
Meas. Tech.
P2X7 Radioligand Binding Assay
Ki
7.90±n/a nM
Citation
 Letavic, MARudolph, DA P2X7 modulators US Patent  US10053462 Publication Date 8/21/2018 
Target
Name:
P2X purinoceptor 7
Synonyms:
P2RX7_MOUSE P2x7
Type:
PROTEIN
Mol. Mass.:
68405.16
Organism:
Mus musculus
Description:
ChEMBL_1473824
Residue:
595
  
Inhibitor
Name:
BDBM174822
Synonyms:
US10053462, 53 US9540388, 53
Type:
Small organic molecule
Emp. Form.:
C19H16F3N5OS
Mol. Mass.:
419.423
SMILES:
Cc1c(cccc1C(F)(F)F)C(=O)N1[C@H]2CC[C@@H]1c1nnc(-c3cscn3)n1C2
: