Target
P2X purinoceptor 7
Ligand
BDBM203314
Substrate
Meas. Tech.
P2X7 Radioligand Binding Assay
Ki
4.90±n/a nM
Citation
 Letavic, MARudolph, DA P2X7 modulators US Patent  US10053462 Publication Date 8/21/2018 
Target
Name:
P2X purinoceptor 7
Synonyms:
P2RX7_MOUSE P2x7
Type:
PROTEIN
Mol. Mass.:
68405.16
Organism:
Mus musculus
Description:
ChEMBL_1473824
Residue:
595
  
Inhibitor
Name:
BDBM203314
Synonyms:
(6r,10s)-11-{[2-chloro-3-(trifluoromethyl)phenyl]carbonyl}-3-(5-fluoro-6-methylpyridin-2-yl)-5,6,7,8,9,10-hexahydro-6,10-epimino[1,2,4]triazolo[4,3-a]azocine US9540388, 193
Type:
Small organic molecule
Emp. Form.:
C22H18ClF4N5O
Mol. Mass.:
479.858
SMILES:
Cc1nc(ccc1F)-c1nnc2[C@H]3CCC[C@@H](Cn12)N3C(=O)c1cccc(c1Cl)C(F)(F)F
: