Target
D(1A) dopamine receptor
Ligand
BDBM364311
Substrate
Meas. Tech.
cAMP HTRF Assay
Ki
179±n/a nM
Citation
 Gray, DLDavoren, JEDounay, ABEfremov, IVMente, SRSubramanyam, C Heteroaromatic compounds and their use as dopamine D1 ligands US Patent  US9856263 Publication Date 1/2/2018 
Target
Name:
D(1A) dopamine receptor
Synonyms:
DA D1 receptor DRD1 Dopamine D1 receptor Dopamine D1A
Type:
Enzyme
Mol. Mass.:
49303.43
Organism:
Homo sapiens (Human)
Description:
P21728
Residue:
446
  
Inhibitor
Name:
BDBM364311
Synonyms:
US9856263, 31
Type:
Small organic molecule
Emp. Form.:
C20H17FN4O
Mol. Mass.:
348.3736
SMILES:
Cc1ncnc(C)c1-c1ccc(Oc2nccn3cccc23)c(F)c1C
: