Target
D(1A) dopamine receptor
Ligand
BDBM364316
Substrate
Meas. Tech.
cAMP HTRF Assay
Ki
48.7±n/a nM
Citation
 Gray, DLDavoren, JEDounay, ABEfremov, IVMente, SRSubramanyam, C Heteroaromatic compounds and their use as dopamine D1 ligands US Patent  US9856263 Publication Date 1/2/2018 
Target
Name:
D(1A) dopamine receptor
Synonyms:
DA D1 receptor DRD1 Dopamine D1 receptor Dopamine D1A
Type:
Enzyme
Mol. Mass.:
49303.43
Organism:
Homo sapiens (Human)
Description:
P21728
Residue:
446
  
Inhibitor
Name:
BDBM364316
Synonyms:
US9856263, 36
Type:
Small organic molecule
Emp. Form.:
C18H14ClN5O
Mol. Mass.:
351.79
SMILES:
Cc1ncnc(C)c1-c1ccc(Oc2ncnn3cccc23)cc1Cl
: