Target
Papain
Ligand
BDBM20096
Substrate
BDBM20081
Meas. Tech.
Papain Inhibition Assay
pH
6.5±n/a
Temperature
298.15±n/a K
Ki
360±10 nM
Km
965000±244000 nM
Citation
 Löser, RSchilling, KDimmig, EGütschow, M Interaction of papain-like cysteine proteases with dipeptide-derived nitriles. J Med Chem 48:7688-707 (2005)  
Target
Name:
Papain
Synonyms:
Allergen=Car p 1 PPI | Papaya proteinase I
Type:
Enzyme
Mol. Mass.:
38923.01
Organism:
Carica papaya
Description:
Papain was purchased from Sigma, Germany.
Residue:
345
  
Inhibitor
Name:
BDBM20096
Synonyms:
CHEMBL344174 dipeptide-derived nitrile, 17
Type:
Small organic molecule
Emp. Form.:
C19H19N3O3
Mol. Mass.:
337.3725
SMILES:
O=C(N[C@@H](Cc1ccccc1)C(=O)NCC#N)OCc1ccccc1
:
Substrate
Name:
BDBM20081
Synonyms:
Z-Phe-Arg-NH-4-nitrophenyl | Z-Phe-Arg-NHNp
Type:
Emp. Form.:
Mol. Mass.:
SMILES:
: