Target
Procathepsin L
Ligand
BDBM20086
Substrate
BDBM20128
Meas. Tech.
Papain Inhibition Assay
Ki
22000±n/a nM
Citation
 Löser, RSchilling, KDimmig, EGütschow, M Interaction of papain-like cysteine proteases with dipeptide-derived nitriles. J Med Chem 48:7688-707 (2005)  
Target
Name:
Procathepsin L
Synonyms:
CATL1_BOVIN CTSL1 Cathepsin L1 heavy chain | Cathepsin L1 light chain
Type:
Enzyme
Mol. Mass.:
37349.52
Organism:
Bos taurus (bovine)
Description:
Bovine liver cathepsin L was purchased from Calbiochem.
Residue:
334
  
Inhibitor
Name:
BDBM20086
Synonyms:
dipeptide-derived nitrile, 6 | tert-butyl N-[(1S)-1-[(cyanomethyl)carbamoyl]butyl]carbamate
Type:
Small organic molecule
Emp. Form.:
C12H21N3O3
Mol. Mass.:
255.3134
SMILES:
CCC[C@H](NC(=O)OC(C)(C)C)C(=O)NCC#N
:
Substrate
Name:
BDBM20128
Synonyms:
Z-Phe-Arg-NH-4-methylcoumarin-7-yl | Z-Phe-Arg-NHMec
Type:
Emp. Form.:
Mol. Mass.:
SMILES:
: