Target
Procathepsin L
Ligand
BDBM20123
Substrate
BDBM20128
Meas. Tech.
Papain Inhibition Assay
Ki
>100000±n/a nM
Citation
 Löser, RSchilling, KDimmig, EGütschow, M Interaction of papain-like cysteine proteases with dipeptide-derived nitriles. J Med Chem 48:7688-707 (2005)  
Target
Name:
Procathepsin L
Synonyms:
CATL1_BOVIN CTSL1 Cathepsin L1 heavy chain | Cathepsin L1 light chain
Type:
Enzyme
Mol. Mass.:
37349.52
Organism:
Bos taurus (bovine)
Description:
Bovine liver cathepsin L was purchased from Calbiochem.
Residue:
334
  
Inhibitor
Name:
BDBM20123
Synonyms:
2-({N-benzyl-N'-[(tert-butoxy)carbonyl]hydrazinecarbonyl}amino)acetonitrile | phenylalanine derivative, 48
Type:
Small organic molecule
Emp. Form.:
C15H20N4O3
Mol. Mass.:
304.3443
SMILES:
CC(C)(C)OC(=O)NN(Cc1ccccc1)C(=O)NCC#N
:
Substrate
Name:
BDBM20128
Synonyms:
Z-Phe-Arg-NH-4-methylcoumarin-7-yl | Z-Phe-Arg-NHMec
Type:
Emp. Form.:
Mol. Mass.:
SMILES:
: