Target
Cathepsin S
Ligand
BDBM20106
Substrate
BDBM20129
Meas. Tech.
Papain Inhibition Assay
Ki
15000±n/a nM
Citation
 Löser, RSchilling, KDimmig, EGütschow, M Interaction of papain-like cysteine proteases with dipeptide-derived nitriles. J Med Chem 48:7688-707 (2005)  
Target
Name:
Cathepsin S
Synonyms:
CATS_HUMAN Cathepsin S (Cat S) | cathepsin S preproprotein
Type:
Protein
Mol. Mass.:
37507.38
Organism:
Homo sapiens (Human)
Description:
P25774
Residue:
331
  
Inhibitor
Name:
BDBM20106
Synonyms:
dipeptide-derived nitrile, 27 | tert-butyl N-[(1S)-1-[(cyanomethyl)carbamoyl]-2-(2,3,4,5,6-pentafluorophenyl)ethyl]carbamate
Type:
Small organic molecule
Emp. Form.:
C16H16F5N3O3
Mol. Mass.:
393.3086
SMILES:
CC(C)(C)OC(=O)N[C@@H](Cc1c(F)c(F)c(F)c(F)c1F)C(=O)NCC#N
:
Substrate
Name:
BDBM20129
Synonyms:
Z-Val-Val-Arg-NH-4-methylcoumarin-7-yl | Z-Val-Val-Arg-NHMec
Type:
Emp. Form.:
Mol. Mass.:
SMILES:
: