Target
Cathepsin K
Ligand
BDBM20107
Substrate
BDBM20130
Meas. Tech.
Papain Inhibition Assay
Ki
28000±n/a nM
Citation
 Löser, RSchilling, KDimmig, EGütschow, M Interaction of papain-like cysteine proteases with dipeptide-derived nitriles. J Med Chem 48:7688-707 (2005)  
Target
Name:
Cathepsin K
Synonyms:
CATK_HUMAN CTSO Cathepsin O Cathepsin X
Type:
Enzyme
Mol. Mass.:
36975.68
Organism:
Homo sapiens (Human)
Description:
P43235
Residue:
329
  
Inhibitor
Name:
BDBM20107
Synonyms:
dipeptide-derived nitrile, 28 | tert-butyl N-[(1S)-2-(4-bromophenyl)-1-[(cyanomethyl)carbamoyl]ethyl]carbamate
Type:
Small organic molecule
Emp. Form.:
C16H20BrN3O3
Mol. Mass.:
382.252
SMILES:
CC(C)(C)OC(=O)N[C@@H](Cc1ccc(Br)cc1)C(=O)NCC#N
:
Substrate
Name:
BDBM20130
Synonyms:
Z-Leu-Arg-NH-4-methylcoumarin-7-yl | Z-Leu-Arg-NHMec
Type:
Emp. Form.:
Mol. Mass.:
SMILES:
: