Target
Transporter
Ligand
BDBM364391
Substrate
Meas. Tech.
Norepinephrine Transporter Binding Assay
Ki
>100000±n/a nM
Citation
 Newman, AHOkunola-Bakare, OMCao, J Potent and selective inhibitors of monoamine transporters; method of making; and use thereof US Patent  US9862679 Publication Date 1/9/2018 
Target
Name:
Transporter
Synonyms:
NE transporter Norepinephrine transporter(NET)
Type:
Multi-pass membrane protein
Mol. Mass.:
69236.90
Organism:
Rattus norvegicus (rat)
Description:
Q63380
Residue:
617
  
Inhibitor
Name:
BDBM364391
Synonyms:
US10913711, Compound 2v US9862679, Compound 2v
Type:
Small organic molecule
Emp. Form.:
C24H23F2NOS
Mol. Mass.:
411.507
SMILES:
Fc1ccc(cc1)C(SCC(=O)NCCCc1ccccc1)c1ccc(F)cc1
: