Target
Sodium-dependent serotonin transporter
Ligand
BDBM364401
Substrate
Meas. Tech.
Serotonin Transporter Binding Assay
Ki
>100000±n/a nM
Citation
 Newman, AHOkunola-Bakare, OMCao, J Potent and selective inhibitors of monoamine transporters; method of making; and use thereof US Patent  US9862679 Publication Date 1/9/2018 
Target
Name:
Sodium-dependent serotonin transporter
Synonyms:
5-HT Transporter 5HT transporter Anandamid membrane transporter, AMT Monoamine transporters; Norepinephrine & serotonin Slc6a4 Sodium-dependent serotonin transporter (SERT) | imipramine receptor
Type:
Multi-pass membrane protein
Mol. Mass.:
70168.43
Organism:
Rattus norvegicus (rat)
Description:
P31652
Residue:
630
  
Inhibitor
Name:
BDBM364401
Synonyms:
US10913711, Compound 3f US9862679, Compound 3f
Type:
Small organic molecule
Emp. Form.:
C16H17NO2S
Mol. Mass.:
287.377
SMILES:
CNC(=O)CS(=O)C(c1ccccc1)c1ccccc1
: