Target
Transporter
Ligand
BDBM364408
Substrate
Meas. Tech.
Norepinephrine Transporter Binding Assay
Ki
11500±759 nM
Citation
 Newman, AHOkunola-Bakare, OMCao, J Potent and selective inhibitors of monoamine transporters; method of making; and use thereof US Patent  US9862679 Publication Date 1/9/2018 
Target
Name:
Transporter
Synonyms:
NE transporter Norepinephrine transporter(NET)
Type:
Multi-pass membrane protein
Mol. Mass.:
69236.90
Organism:
Rattus norvegicus (rat)
Description:
Q63380
Residue:
617
  
Inhibitor
Name:
BDBM364408
Synonyms:
US10913711, Compound 4e US9862679, Compound 4e
Type:
Small organic molecule
Emp. Form.:
C19H25NS
Mol. Mass.:
299.474
SMILES:
CCCCNCCSC(c1ccccc1)c1ccccc1
: