Target
Sodium-dependent dopamine transporter
Ligand
BDBM364409
Substrate
Meas. Tech.
Dopamine Transporter Binding Assay
Ki
297±28.2 nM
Citation
 Newman, AHOkunola-Bakare, OMCao, J Potent and selective inhibitors of monoamine transporters; method of making; and use thereof US Patent  US9862679 Publication Date 1/9/2018 
Target
Name:
Sodium-dependent dopamine transporter
Synonyms:
DA transporter SC6A3_RAT Sodium-dependent dopamine transporter | Sodium-dependent dopamine transporter (DAT)
Type:
Multi-pass membrane protein
Mol. Mass.:
68749.45
Organism:
Rattus norvegicus (rat)
Description:
P23977
Residue:
619
  
Inhibitor
Name:
BDBM364409
Synonyms:
US10913711, Compound 4f US9862679, Compound 4f
Type:
Small organic molecule
Emp. Form.:
C24H27NS
Mol. Mass.:
361.543
SMILES:
C(CNCCSC(c1ccccc1)c1ccccc1)Cc1ccccc1
: