Target
Sigma non-opioid intracellular receptor 1
Ligand
BDBM364421
Substrate
Meas. Tech.
Uptake Assays
Ki
42.4±5.10 nM
Citation
 Newman, AHOkunola-Bakare, OMCao, J Potent and selective inhibitors of monoamine transporters; method of making; and use thereof US Patent  US9862679 Publication Date 1/9/2018 
Target
Name:
Sigma non-opioid intracellular receptor 1
Synonyms:
Opioid receptor SGMR1_RAT Sigma non-opioid intracellular receptor 1 Sigma-1 | Sigmar1
Type:
Enzyme Catalytic Domain
Mol. Mass.:
25266.54
Organism:
RAT
Description:
Q9R0C9
Residue:
223
  
Inhibitor
Name:
BDBM364421
Synonyms:
US10913711, Compound 8b | US9862679, Compound 8b
Type:
Small organic molecule
Emp. Form.:
C28H32F2N2OS
Mol. Mass.:
482.628
SMILES:
Fc1ccc(cc1)C(c1ccc(F)cc1)S(=O)CCN1CCN(CCCc2ccccc2)CC1
: