Target
Sigma non-opioid intracellular receptor 1
Ligand
BDBM50199800
Substrate
Meas. Tech.
Uptake Assays
Ki
30.0±3.81 nM
Citation
 Newman, AHOkunola-Bakare, OMCao, J Potent and selective inhibitors of monoamine transporters; method of making; and use thereof US Patent  US9862679 Publication Date 1/9/2018 
Target
Name:
Sigma non-opioid intracellular receptor 1
Synonyms:
Opioid receptor SGMR1_RAT Sigma non-opioid intracellular receptor 1 Sigma-1 | Sigmar1
Type:
Enzyme Catalytic Domain
Mol. Mass.:
25266.54
Organism:
RAT
Description:
Q9R0C9
Residue:
223
  
Inhibitor
Name:
BDBM50199800
Synonyms:
CHEMBL3979590 US11555013, Compound 9g | US9862679, Compound 9g
Type:
Small organic molecule
Emp. Form.:
C28H34N2OS
Mol. Mass.:
446.647
SMILES:
OC(CN1CCN(CCSC(c2ccccc2)c2ccccc2)CC1)Cc1ccccc1
: