Target
Sigma non-opioid intracellular receptor 1
Ligand
BDBM364429
Substrate
Meas. Tech.
Uptake Assays
Ki
983±103 nM
Citation
 Newman, AHOkunola-Bakare, OMCao, J Potent and selective inhibitors of monoamine transporters; method of making; and use thereof US Patent  US9862679 Publication Date 1/9/2018 
Target
Name:
Sigma non-opioid intracellular receptor 1
Synonyms:
Opioid receptor SGMR1_RAT Sigma non-opioid intracellular receptor 1 Sigma-1 | Sigmar1
Type:
Enzyme Catalytic Domain
Mol. Mass.:
25266.54
Organism:
RAT
Description:
Q9R0C9
Residue:
223
  
Inhibitor
Name:
BDBM364429
Synonyms:
US10913711, Compound 10g US9862679, Compound 10g
Type:
Small organic molecule
Emp. Form.:
C28H34N2O2S
Mol. Mass.:
462.647
SMILES:
OC(CN1CCN(CCS(=O)C(c2ccccc2)c2ccccc2)CC1)Cc1ccccc1
: