Target
Sigma non-opioid intracellular receptor 1
Ligand
BDBM50199810
Substrate
Meas. Tech.
Uptake Assays
Ki
1120±20.3 nM
Citation
 Newman, AHOkunola-Bakare, OMCao, J Potent and selective inhibitors of monoamine transporters; method of making; and use thereof US Patent  US9862679 Publication Date 1/9/2018 
Target
Name:
Sigma non-opioid intracellular receptor 1
Synonyms:
Opioid receptor SGMR1_RAT Sigma non-opioid intracellular receptor 1 Sigma-1 | Sigmar1
Type:
Enzyme Catalytic Domain
Mol. Mass.:
25266.54
Organism:
RAT
Description:
Q9R0C9
Residue:
223
  
Inhibitor
Name:
BDBM50199810
Synonyms:
CHEMBL3899193 US11555013, Compound 11a | US9862679, Compound 12a
Type:
Small organic molecule
Emp. Form.:
C28H32N2OS
Mol. Mass.:
444.631
SMILES:
O=C(CSC(c1ccccc1)c1ccccc1)N1CCN(CCCc2ccccc2)CC1
: