Target
Tyrosine-protein kinase ABL1
Ligand
BDBM364403
Substrate
Meas. Tech.
In Vitro Activity Assay
IC50
3040±n/a nM
Citation
 Gray, NSTan, L Hydrophobically tagged janus kinase inhibitors and uses thereof US Patent  US9862688 Publication Date 1/9/2018 
Target
Name:
Tyrosine-protein kinase ABL1
Synonyms:
ABL ABL1_HUMAN JTK7 Proto-oncogene tyrosine-protein kinase ABL1 Tyrosine-protein kinase ABL V-abl Abelson murine leukemia viral oncogene homolog 1 p150 | tyrosine-protein kinase ABL1 isoform a
Type:
Enzyme
Mol. Mass.:
122897.30
Organism:
Homo sapiens (Human)
Description:
P00519
Residue:
1130
  
Inhibitor
Name:
BDBM364403
Synonyms:
US9862688, Compound 2
Type:
Small organic molecule
Emp. Form.:
C40H51ClN8O3
Mol. Mass.:
727.338
SMILES:
COc1cc(ccc1Nc1ncc(Cl)c(NCc2cccc(NC(=O)C=C)c2)n1)N1CCN(CCCNC(=O)CC2[C@H]3C[C@@H]4C[C@H](C[C@@H]2C4)C3)CC1
: