Target
Tyrosine-protein kinase ABL1
Ligand
BDBM364417
Substrate
Meas. Tech.
In Vitro Activity Assay
IC50
623±n/a nM
Citation
 Gray, NSTan, L Hydrophobically tagged janus kinase inhibitors and uses thereof US Patent  US9862688 Publication Date 1/9/2018 
Target
Name:
Tyrosine-protein kinase ABL1
Synonyms:
ABL ABL1_HUMAN JTK7 Proto-oncogene tyrosine-protein kinase ABL1 Tyrosine-protein kinase ABL V-abl Abelson murine leukemia viral oncogene homolog 1 p150 | tyrosine-protein kinase ABL1 isoform a
Type:
Enzyme
Mol. Mass.:
122897.30
Organism:
Homo sapiens (Human)
Description:
P00519
Residue:
1130
  
Inhibitor
Name:
BDBM364417
Synonyms:
US9862688, Compound 4
Type:
Small organic molecule
Emp. Form.:
C40H51ClN8O2
Mol. Mass.:
711.338
SMILES:
Clc1cnc(Nc2ccc(cc2)N2CCN(CCCCNC(=O)CC3[C@H]4C[C@@H]5C[C@@H](C[C@H]3C5)C4)CC2)nc1NCc1cccc(NC(=O)C=C)c1
: