Target
Non-receptor tyrosine-protein kinase TYK2
Ligand
BDBM364420
Substrate
Meas. Tech.
In Vitro Activity Assay
IC50
1.64±n/a nM
Citation
 Gray, NSTan, L Hydrophobically tagged janus kinase inhibitors and uses thereof US Patent  US9862688 Publication Date 1/9/2018 
Target
Name:
Non-receptor tyrosine-protein kinase TYK2
Synonyms:
Non-receptor tyrosine-protein kinase TYK2 (TYK2) TYK2_HUMAN | Tyrosine-protein kinase TYK2
Type:
Protein
Mol. Mass.:
133666.03
Organism:
Homo sapiens (Human)
Description:
P29597
Residue:
1187
  
Inhibitor
Name:
BDBM364420
Synonyms:
US9862688, Compound 6
Type:
Small organic molecule
Emp. Form.:
C34H41ClN8O2
Mol. Mass.:
629.195
SMILES:
Clc1cnc(Nc2cnn(c2)C2CCN(CC2)C(=O)CC2[C@H]3CC4C[C@@H](C[C@H]2C4)C3)nc1NCc1cccc(NC(=O)C=C)c1
: