Target
High affinity nerve growth factor receptor
Ligand
BDBM364484
Substrate
Meas. Tech.
Biological Assay
IC50
6.90±n/a nM
Citation
 Mitchell, HWood, HBLi, CSMao, QQi, Z TrkA kinase inhibitors, compositions and methods thereof US Patent  US9862707 Publication Date 1/9/2018 
Target
Name:
High affinity nerve growth factor receptor
Synonyms:
2.7.10.1 NTRK1 NTRK1_HUMAN Neurotrophic tyrosine kinase receptor type 1 Synonyms=MTC TRK1-transforming tyrosine kinase protein TRKA GN Tropomyosin alpha-3 chain/High affinity nerve growth factor receptor Tropomyosin-related kinase A (TrkA) Tyrosine kinase receptor (Trk) Tyrosine kinase receptor A (Trk A) Tyrosine kinase receptor A (TrkA) p140-TrkA
Type:
Mol. Mass.:
87498.18
Organism:
Homo sapiens (Human)
Description:
P04629
Residue:
796
  
Inhibitor
Name:
BDBM364484
Synonyms:
(R or S)-N-[5-(2,2-difluoro-1- hydroxyethyl)-2-phenyl-2H- indazol-3-yl]-2-fluoro-5-pyrimidin- 2-yl-4-(trifluoromethyl)benzamide, isomer A US9862707, Example 59
Type:
Small organic molecule
Emp. Form.:
C27H17F6N5O2
Mol. Mass.:
557.4466
SMILES:
OC(C(F)F)c1ccc2nn(c(NC(=O)c3cc(-c4ncccn4)c(cc3F)C(F)(F)F)c2c1)-c1ccccc1
: