Target
High affinity nerve growth factor receptor
Ligand
BDBM364504
Substrate
Meas. Tech.
Biological Assay
IC50
11.0±n/a nM
Citation
 Mitchell, HWood, HBLi, CSMao, QQi, Z TrkA kinase inhibitors, compositions and methods thereof US Patent  US9862707 Publication Date 1/9/2018 
Target
Name:
High affinity nerve growth factor receptor
Synonyms:
2.7.10.1 NTRK1 NTRK1_HUMAN Neurotrophic tyrosine kinase receptor type 1 Synonyms=MTC TRK1-transforming tyrosine kinase protein TRKA GN Tropomyosin alpha-3 chain/High affinity nerve growth factor receptor Tropomyosin-related kinase A (TrkA) Tyrosine kinase receptor (Trk) Tyrosine kinase receptor A (Trk A) Tyrosine kinase receptor A (TrkA) p140-TrkA
Type:
Mol. Mass.:
87498.18
Organism:
Homo sapiens (Human)
Description:
P04629
Residue:
796
  
Inhibitor
Name:
BDBM364504
Synonyms:
3-({[3-(1-methyl-1H-pyrazol-3-yl)- 4- (trifluoromethyl)phenyl]carbonyl} amino)-2-phenyl-2H-indazole-5- carboxamide | US9862707, Example 79
Type:
Small organic molecule
Emp. Form.:
C26H19F3N6O2
Mol. Mass.:
504.4633
SMILES:
Cn1ccc(n1)-c1cc(ccc1C(F)(F)F)C(=O)Nc1n(nc2ccc(cc12)C(N)=O)-c1ccccc1
: