Target
Serine/threonine-protein kinase mTOR
Ligand
BDBM364529
Substrate
Meas. Tech.
Lanthascreen Kinase Binding Assay
IC50
5250±n/a nM
Citation
 Bellenie, BRBruce, ICulshaw, AJHollingworth, GJNeef, JSpendiff, MWatson, SJ Pyrazine derivatives as phosphatidylinositol 3-kinase inhibitors US Patent  US9862711 Publication Date 1/9/2018 
Target
Name:
Serine/threonine-protein kinase mTOR
Synonyms:
FK506-binding protein 12-rapamycin complex-associated protein 1 FRAP FRAP1 MTOR Mammalian Target of Rapamycin (mTOR) RAFT1 Rapamycin and FKBP12 target 1 Serine/threonine-protein kinase (mTOR) | mTORC2
Type:
Rapamycin target protein
Mol. Mass.:
288917.12
Organism:
Homo sapiens (Human)
Description:
P42345
Residue:
2549
  
Inhibitor
Name:
BDBM364529
Synonyms:
N-(3-Hydroxy-propyl)-4-methyl-3-[6-(2-methyl-thiazol-5-yl)-pyrazin-2-yl]-benzenesulfonamide | US9862711, Example 1
Type:
Small organic molecule
Emp. Form.:
C18H20N4O3S2
Mol. Mass.:
404.506
SMILES:
Cc1ncc(s1)-c1cncc(n1)-c1cc(ccc1C)S(=O)(=O)NCCCO
: