Target
Phosphatidylinositol 4,5-bisphosphate 3-kinase catalytic subunit gamma isoform
Ligand
BDBM364531
Substrate
Meas. Tech.
TR-FRET Adapta Assay
IC50
48.0±n/a nM
Citation
 Bellenie, BRBruce, ICulshaw, AJHollingworth, GJNeef, JSpendiff, MWatson, SJ Pyrazine derivatives as phosphatidylinositol 3-kinase inhibitors US Patent  US9862711 Publication Date 1/9/2018 
Target
Name:
Phosphatidylinositol 4,5-bisphosphate 3-kinase catalytic subunit gamma isoform
Synonyms:
PI3-kinase p110 subunit gamma PI3Kgamma PK3CG_HUMAN Phosphatidylinositol 4,5-bisphosphate 3-kinase (PI3K) Phosphatidylinositol 4,5-bisphosphate 3-kinase catalytic subunit gamma (PI3Kgamma) Phosphatidylinositol 4,5-bisphosphate 3-kinase catalytic subunit gamma isoform (PI3K) Phosphatidylinositol-4,5-bisphosphate 3-kinase catalytic subunit gamma isoform Phosphoinositide 3-kinases gamma (PI3K gamma) p120-PI3K
Type:
Enzyme Subunit
Mol. Mass.:
126470.30
Organism:
Homo sapiens (Human)
Description:
P48736
Residue:
1102
  
Inhibitor
Name:
BDBM364531
Synonyms:
3-[6-(1,3-Dimethyl-1H-pyrazol-4-yl)-pyrazin-2-yl]-N-(3-hydroxy-3-methyl-butyl)-4-methyl-benzenesulfonamide | US9862711, Example 3
Type:
Small organic molecule
Emp. Form.:
C21H27N5O3S
Mol. Mass.:
429.536
SMILES:
Cc1nn(C)cc1-c1cncc(n1)-c1cc(ccc1C)S(=O)(=O)NCCC(C)(C)O
: