Target
Phosphatidylinositol 4,5-bisphosphate 3-kinase catalytic subunit delta isoform
Ligand
BDBM364532
Substrate
Meas. Tech.
Kinase Glo Luminescent Kinase Assay
IC50
70.0±n/a nM
Citation
 Bellenie, BRBruce, ICulshaw, AJHollingworth, GJNeef, JSpendiff, MWatson, SJ Pyrazine derivatives as phosphatidylinositol 3-kinase inhibitors US Patent  US9862711 Publication Date 1/9/2018 
Target
Name:
Phosphatidylinositol 4,5-bisphosphate 3-kinase catalytic subunit delta isoform
Synonyms:
PI3-kinase p110 subunit delta PI3-kinase subunit p110-delta PIK3CD Phosphatidylinositol 4,5-biphosphate 3-kinase catalytic subunit delta (PIK3CD) Phosphatidylinositol 4,5-bisphosphate 3-kinase 110 kDa catalytic subunit delta (PI3K delta) Phosphatidylinositol 4,5-bisphosphate 3-kinase catalytic subunit delta (PI3Kdelta) Phosphatidylinositol 4,5-bisphosphate 3-kinase catalytic subunit delta isoform (PI3K delta) Phosphatidylinositol 4,5-bisphosphate 3-kinase catalytic subunit delta isoform (PI3K-delta) Phosphatidylinositol 4,5-bisphosphate 3-kinase catalytic subunit delta isoform (PI3Kdelta)
Type:
Enzyme Subunit
Mol. Mass.:
119489.41
Organism:
Homo sapiens (Human)
Description:
O00329
Residue:
1044
  
Inhibitor
Name:
BDBM364532
Synonyms:
Trans 3-[6-(1,3-Dimethyl-1H-pyrazol-4-yl)-pyrazin-2-yl]-4-methyl-N-(3-methyl-oxetan-3-ylmethyl)-benzenesulfonamide | US9862711, Example 4
Type:
Small organic molecule
Emp. Form.:
C21H25N5O3S
Mol. Mass.:
427.52
SMILES:
Cc1nn(C)cc1-c1cncc(n1)-c1cc(ccc1C)S(=O)(=O)NCC1(C)COC1
: