Target
Phosphatidylinositol 4-kinase beta
Ligand
BDBM364534
Substrate
Meas. Tech.
Kinase Glo Luminescent Kinase Assay
IC50
>10000±n/a nM
Citation
 Bellenie, BRBruce, ICulshaw, AJHollingworth, GJNeef, JSpendiff, MWatson, SJ Pyrazine derivatives as phosphatidylinositol 3-kinase inhibitors US Patent  US9862711 Publication Date 1/9/2018 
Target
Name:
Phosphatidylinositol 4-kinase beta
Synonyms:
NPIK PI4K-beta PI4KB PI4Kbeta PIK4CB Phosphatidylinositol 4-kinase, PI4K | PtdIns 4-kinase beta
Type:
Protein
Mol. Mass.:
91373.30
Organism:
Homo sapiens (Human)
Description:
Residue:
816
  
Inhibitor
Name:
BDBM364534
Synonyms:
3-[6-(1,3-Dimethyl-1H-pyrazol-4-yl)-pyrazin-2-yl]-N-(6-hydroxy-spiro[3.3]hept-2-yl)-4-methyl-benzenesulfonamide | US9862711, Example 6
Type:
Small organic molecule
Emp. Form.:
C23H27N5O3S
Mol. Mass.:
453.557
SMILES:
Cc1nn(C)cc1-c1cncc(n1)-c1cc(ccc1C)S(=O)(=O)NC1CC2(CC(O)C2)C1
: