Target
Serine/threonine-protein kinase mTOR
Ligand
BDBM364536
Substrate
Meas. Tech.
Lanthascreen Kinase Binding Assay
IC50
1950±n/a nM
Citation
 Bellenie, BRBruce, ICulshaw, AJHollingworth, GJNeef, JSpendiff, MWatson, SJ Pyrazine derivatives as phosphatidylinositol 3-kinase inhibitors US Patent  US9862711 Publication Date 1/9/2018 
Target
Name:
Serine/threonine-protein kinase mTOR
Synonyms:
FK506-binding protein 12-rapamycin complex-associated protein 1 FRAP FRAP1 MTOR Mammalian Target of Rapamycin (mTOR) RAFT1 Rapamycin and FKBP12 target 1 Serine/threonine-protein kinase (mTOR) | mTORC2
Type:
Rapamycin target protein
Mol. Mass.:
288917.12
Organism:
Homo sapiens (Human)
Description:
P42345
Residue:
2549
  
Inhibitor
Name:
BDBM364536
Synonyms:
3-[6-(1,3-Dimethyl-1H-pyrazol-4-yl)-pyrazin-2-yl]-N-(3-hydroxy-2,2-dimethyl-propyl)-4-methyl-benzenesulfonamide | US9862711, Example 8
Type:
Small organic molecule
Emp. Form.:
C21H27N5O3S
Mol. Mass.:
429.536
SMILES:
Cc1nn(C)cc1-c1cncc(n1)-c1cc(ccc1C)S(=O)(=O)NCC(C)(C)CO
: