Target
Phosphatidylinositol 4,5-bisphosphate 3-kinase catalytic subunit delta isoform
Ligand
BDBM364538
Substrate
Meas. Tech.
Kinase Glo Luminescent Kinase Assay
IC50
20.0±n/a nM
Citation
 Bellenie, BRBruce, ICulshaw, AJHollingworth, GJNeef, JSpendiff, MWatson, SJ Pyrazine derivatives as phosphatidylinositol 3-kinase inhibitors US Patent  US9862711 Publication Date 1/9/2018 
Target
Name:
Phosphatidylinositol 4,5-bisphosphate 3-kinase catalytic subunit delta isoform
Synonyms:
PI3-kinase p110 subunit delta PI3-kinase subunit p110-delta PIK3CD Phosphatidylinositol 4,5-biphosphate 3-kinase catalytic subunit delta (PIK3CD) Phosphatidylinositol 4,5-bisphosphate 3-kinase 110 kDa catalytic subunit delta (PI3K delta) Phosphatidylinositol 4,5-bisphosphate 3-kinase catalytic subunit delta (PI3Kdelta) Phosphatidylinositol 4,5-bisphosphate 3-kinase catalytic subunit delta isoform (PI3K delta) Phosphatidylinositol 4,5-bisphosphate 3-kinase catalytic subunit delta isoform (PI3K-delta) Phosphatidylinositol 4,5-bisphosphate 3-kinase catalytic subunit delta isoform (PI3Kdelta)
Type:
Enzyme Subunit
Mol. Mass.:
119489.41
Organism:
Homo sapiens (Human)
Description:
O00329
Residue:
1044
  
Inhibitor
Name:
BDBM364538
Synonyms:
N-(3-Hydroxy-3-methyl-butyl)-4-methyl-3-{6-[3-methyl-1-(2-morpholin-4-yl-ethyl)-1H-pyrazol-4-yl]-pyrazin-2-yl}-benzenesulfonamide | US9862711, Example 10
Type:
Small organic molecule
Emp. Form.:
C26H36N6O4S
Mol. Mass.:
528.667
SMILES:
Cc1nn(CCN2CCOCC2)cc1-c1cncc(n1)-c1cc(ccc1C)S(=O)(=O)NCCC(C)(C)O
: