Target
Ectonucleotide pyrophosphatase/phosphodiesterase family member 2
Ligand
BDBM232954
Substrate
Meas. Tech.
Inhibitory Activity Assay
IC50
8.00±n/a nM
Citation
 Ohata, ANakatani, SSugiyama, TMorimoto, T Tetrahydrocarboline derivative US Patent  US9862721 Publication Date 1/9/2018 
Target
Name:
Ectonucleotide pyrophosphatase/phosphodiesterase family member 2
Synonyms:
ATX Autotaxin (ATX) ENPP2 Ectonucleotide Pyrophosphatase/Phosphodiesterase 2 (ENPP2) Extracellular lysophospholipase D PDNP2
Type:
Enzyme
Mol. Mass.:
99007.13
Organism:
Homo sapiens (Human)
Description:
Q13822
Residue:
863
  
Inhibitor
Name:
BDBM232954
Synonyms:
US9353113, 6(63) | US9862721, 6(63)
Type:
Small Organic Molecule
Emp. Form.:
C27H31F3N4O3S
Mol. Mass.:
548.62
SMILES:
Cc1nc(sc1Cn1c2CN(CCc2c2cccnc12)C(=O)C[C@H]1CC[C@@](C)(C(O)=O)C1(C)C)C(F)(F)F
: