Target
Ectonucleotide pyrophosphatase/phosphodiesterase family member 2
Ligand
BDBM232957
Substrate
Meas. Tech.
Inhibitory Activity Assay
IC50
4.90±n/a nM
Citation
 Ohata, ANakatani, SSugiyama, TMorimoto, T Tetrahydrocarboline derivative US Patent  US9862721 Publication Date 1/9/2018 
Target
Name:
Ectonucleotide pyrophosphatase/phosphodiesterase family member 2
Synonyms:
ATX Autotaxin (ATX) ENPP2 Ectonucleotide Pyrophosphatase/Phosphodiesterase 2 (ENPP2) Extracellular lysophospholipase D PDNP2
Type:
Enzyme
Mol. Mass.:
99007.13
Organism:
Homo sapiens (Human)
Description:
Q13822
Residue:
863
  
Inhibitor
Name:
BDBM232957
Synonyms:
US9353113, 7(41) | US9862721, 7(41)
Type:
Small Organic Molecule
Emp. Form.:
C26H30F3N5O3S
Mol. Mass.:
549.608
SMILES:
C[C@H]1CN(CC(=O)N2CCc3c(C2)n(Cc2ccc(s2)C(F)(F)F)c2ncccc32)C[C@@H](C)N1CC(O)=O
: