Target
Oxysterols receptor LXR-alpha
Ligand
BDBM20132
Substrate
biotinylated SRC-1 peptide
Meas. Tech.
Fluorescence-Resonance Energy Transfer Assay
pH
7.2±n/a
Temperature
310.15±n/a K
EC50
1600±n/a nM
Comments
FRET LXRalpha, efficacy = 64 %. 39% induction of ABCA1 gene activity in human THP-1 cells @ 1uM.
Citation
 Molteni, VLi, XNabakka, JLiang, FWityak, JKoder, AVargas, LRomeo, RMitro, NMak, PASeidel, HMHaslam, JAChow, DTuntland, TSpalding, TABrock, ABradley, MCastrillo, ATontonoz, PSaez, E N-Acylthiadiazolines, a new class of liver X receptor agonists with selectivity for LXRbeta. J Med Chem 50:4255-9 (2007)  
Target
Name:
Oxysterols receptor LXR-alpha
Synonyms:
LXRA Liver X receptor alpha Liver X receptor alpha (NR1H3) NR1H3 Nuclear orphan receptor LXR-alpha | Nuclear receptor subfamily 1 group H member 3
Type:
Enzyme Catalytic Domain
Mol. Mass.:
50403.85
Organism:
Homo sapiens (Human)
Description:
Q13133
Residue:
447
  
Inhibitor
Name:
BDBM20132
Synonyms:
(2R)-5-(4-chlorophenyl)-2-(2,3-dimethoxyphenyl)-3-[(2,4,6-trifluorophenyl)carbonyl]-2,3-dihydro-1,3,4-thiadiazole | N-Acylthiadiazoline, 3-R
Type:
Small organic molecule
Emp. Form.:
C23H16ClF3N2O3S
Mol. Mass.:
492.898
SMILES:
COc1cccc([C@H]2SC(=NN2C(=O)c2c(F)cc(F)cc2F)c2ccc(Cl)cc2)c1OC
:
Substrate
Name:
biotinylated SRC-1 peptide
Synonyms:
Type:
Peptide
Mol. Mass.:
2905.78
Organism:
Description:
Residue:
26