Target
Oxysterols receptor LXR-beta
Ligand
BDBM20141
Substrate
biotinylated SRC-1 peptide
Meas. Tech.
Fluorescence-Resonance Energy Transfer Assay
EC50
560±n/a nM
Citation
 Molteni, VLi, XNabakka, JLiang, FWityak, JKoder, AVargas, LRomeo, RMitro, NMak, PASeidel, HMHaslam, JAChow, DTuntland, TSpalding, TABrock, ABradley, MCastrillo, ATontonoz, PSaez, E N-Acylthiadiazolines, a new class of liver X receptor agonists with selectivity for LXRbeta. J Med Chem 50:4255-9 (2007)  
Target
Name:
Oxysterols receptor LXR-beta
Synonyms:
LXRB Liver X, LXR beta NR1H2 Nuclear receptor NER Ubiquitously-expressed nuclear receptor
Type:
Enzyme Catalytic Domain
Mol. Mass.:
50978.79
Organism:
Homo sapiens (Human)
Description:
P55055
Residue:
460
  
Inhibitor
Name:
BDBM20141
Synonyms:
5-(3,4-difluorophenyl)-2-(2,3-dimethoxyphenyl)-3-[(3-fluorophenyl)carbonyl]-2,3-dihydro-1,3,4-thiadiazole | N-Acylthiadiazoline, 21
Type:
Small organic molecule
Emp. Form.:
C23H17F3N2O3S
Mol. Mass.:
458.453
SMILES:
COc1cccc(C2SC(=NN2C(=O)c2cccc(F)c2)c2ccc(F)c(F)c2)c1OC
:
Substrate
Name:
biotinylated SRC-1 peptide
Synonyms:
Type:
Peptide
Mol. Mass.:
2905.78
Organism:
Description:
Residue:
26