Target
Signal transducer and activator of transcription 3
Ligand
BDBM20249
Substrate
c-fos sis inducible element (hSIE)
Meas. Tech.
Electrophoretic Mobility Shift Assay (EMSA)
pH
7.8±n/a
Temperature
295.15±n/a K
IC50
6000±n/a nM
Citation
 Ren, ZCabell, LASchaefer, TSMcMurray, JS Identification of a high-affinity phosphopeptide inhibitor of Stat3. Bioorg Med Chem Lett 13:633-6 (2003)  
Target
Name:
Signal transducer and activator of transcription 3
Synonyms:
Acute-phase response factor STAT3 alpha Signal transducer and activator of transcription 3 Transcription Factor STAT3
Type:
Cytosolic Transcription Factor
Mol. Mass.:
88050.28
Organism:
Mus musculus (mouse)
Description:
Bacterially expressed protein was used in the FP assay.
Residue:
770
  
Inhibitor
Name:
BDBM20249
Synonyms:
4-[(2S)-2-{[(1S)-4-carbamimidamido-1-{[(1S)-1-{[(1S)-3-carbamoyl-1-{[(2S)-1-[(2S)-2-carbamoylpyrrolidin-1-yl]-3-methyl-1-oxobutan-2-yl]carbamoyl}propyl]carbamoyl}-2-(1H-imidazol-4-yl)ethyl]carbamoyl}butyl]carbamoyl}-2-acetamidoethyl]phenoxyphosphonic acid gp130 (767) derived peptide, 4
Type:
Phosphopeptide
Emp. Form.:
C38H58N13O12P
Mol. Mass.:
919.9208
SMILES:
CC(C)[C@H](NC(=O)[C@H](CCC(N)=O)NC(=O)[C@H](Cc1cnc[nH]1)NC(=O)[C@H](CCCN=C(N)N)NC(=O)[C@H](Cc1ccc(OP(O)(O)=O)cc1)NC(C)=O)C(=O)N1CCC[C@H]1C(N)=O
:
Substrate
Name:
c-fos sis inducible element (hSIE)
Synonyms:
32P-labeled c-fos sis inducible element (hSIE)
Type:
Oligonucleotide
Mol. Mass.:
2192.56
Organism:
Description:
hSIE derived from the c-fos gene promoter.
Residue:
24