Target
Signal transducer and activator of transcription 3
Ligand
BDBM20265
Substrate
c-fos sis inducible element (hSIE)
Meas. Tech.
Electrophoretic Mobility Shift Assay (EMSA)
pH
7.8±n/a
Temperature
295.15±n/a K
IC50
800±n/a nM
Citation
 Ren, ZCabell, LASchaefer, TSMcMurray, JS Identification of a high-affinity phosphopeptide inhibitor of Stat3. Bioorg Med Chem Lett 13:633-6 (2003)  
Target
Name:
Signal transducer and activator of transcription 3
Synonyms:
Acute-phase response factor STAT3 alpha Signal transducer and activator of transcription 3 Transcription Factor STAT3
Type:
Cytosolic Transcription Factor
Mol. Mass.:
88050.28
Organism:
Mus musculus (mouse)
Description:
Bacterially expressed protein was used in the FP assay.
Residue:
770
  
Inhibitor
Name:
BDBM20265
Synonyms:
4-[(2S)-2-{[(2S)-1-[(2S)-2-{[(1S)-3-carbamoyl-1-{[(1S)-1-{[(1S)-1-carbamoyl-2-methylpropyl]carbamoyl}ethyl]carbamoyl}propyl]carbamoyl}pyrrolidin-1-yl]-4-methyl-1-oxopentan-2-yl]carbamoyl}-2-acetamidoethyl]phenoxyphosphonic acid gp130 (904) derived peptide, 23
Type:
Phosphopeptide
Emp. Form.:
C35H55N8O12P
Mol. Mass.:
810.8314
SMILES:
CC(C)C[C@H](NC(=O)[C@H](Cc1ccc(OP(O)(O)=O)cc1)NC(C)=O)C(=O)N1CCC[C@H]1C(=O)N[C@@H](CCC(N)=O)C(=O)N[C@@H](C)C(=O)N[C@@H](C(C)C)C(N)=O
:
Substrate
Name:
c-fos sis inducible element (hSIE)
Synonyms:
32P-labeled c-fos sis inducible element (hSIE)
Type:
Oligonucleotide
Mol. Mass.:
2192.56
Organism:
Description:
hSIE derived from the c-fos gene promoter.
Residue:
24