Target
P2X purinoceptor 7
Ligand
BDBM160130
Substrate
Meas. Tech.
P2X7 Radioligand Binding
Ki
2.50±n/a nM
Citation
 Ameriks, MKRech, JCSavall, BMWall, JL Substituted [1,2,4]triazolo[4,3-a]pyrazines as P2X7 modulators US Patent  US10053463 Publication Date 8/21/2018 
Target
Name:
P2X purinoceptor 7
Synonyms:
ATP receptor P2RX7_HUMAN P2X purinoceptor 7 (P2X7) P2Z receptor | Purinergic receptor
Type:
Protein
Mol. Mass.:
68602.85
Organism:
Homo sapiens (Human)
Description:
Q99572
Residue:
595
  
Inhibitor
Name:
BDBM160130
Synonyms:
US10047092, 72 US9040534, 71 | US9040534, 72
Type:
Small organic molecule
Emp. Form.:
C19H16ClF3N6O
Mol. Mass.:
436.818
SMILES:
CC[C@H]1Cn2c(nnc2-c2ncccn2)C(=O)N1Cc1cccc(c1Cl)C(F)(F)F
: