Target
Transient receptor potential cation channel subfamily V member 1
Ligand
BDBM20306
Substrate
BDBM20285
Meas. Tech.
Competition Binding Assay and Inhibition of Ca2+ Uptake Assay
pH
7.4±n/a
Temperature
310.15±n/a K
Ki
16.5±2.4 nM
EC50
10±2.5 nM
Citation
 Ryu, HJin, MKKim, SYChoi, HKKang, SUKang, DWLee, JPearce, LVPavlyukovets, VAMorgan, MATran, RToth, ALundberg, DJBlumberg, PM Stereospecific high-affinity TRPV1 antagonists: chiral N-(2-Benzyl-3-pivaloyloxypropyl) 2-[4-(methylsulfonylamino)phenyl]propionamide analogues. J Med Chem 51:57-67 (2008)  
Target
Name:
Transient receptor potential cation channel subfamily V member 1
Synonyms:
Capsaicin receptor TRPV1_RAT Trpv1 Vanilloid VR1 Vanilloid receptor 1 (VRI/TRPV1) Vanilloid receptor type 1-like (TrpV1/Vr1) Vr1l | osm-9-like TRP channel 1
Type:
Transient Receptor
Mol. Mass.:
94956.12
Organism:
Rattus norvegicus (rat)
Description:
O35433
Residue:
838
  
Inhibitor
Name:
BDBM20306
Synonyms:
(2S)-2-benzyl-3-[(2S)-2-(3-fluoro-4-methanesulfonamidophenyl)propanamido]propyl 2,2-dimethylpropanoate | benzyl derivative, 57
Type:
Small organic molecule
Emp. Form.:
C25H33FN2O5S
Mol. Mass.:
492.603
SMILES:
C[C@H](C(=O)NC[C@@H](COC(=O)C(C)(C)C)Cc1ccccc1)c1ccc(NS(C)(=O)=O)c(F)c1
:
Substrate
Name:
BDBM20285
Synonyms:
Resiniferatoxin | [(1R,2R,6R,10S,11R,15R,17R)-13-benzyl-6-hydroxy-4,17-dimethyl-5-oxo-15-(prop-1-en-2-yl)-12,14,18-trioxapentacyclo[11.4.1.0^{1,10}.0^{2,6}.0^{11,15}]octadeca-3,8-dien-8-yl]methyl 2-(4-hydroxy-3-methoxyphenyl)acetate
Type:
Small organic molecule
Emp. Form.:
C37H40O9
Mol. Mass.:
628.7081
SMILES:
[H][C@]12OC3(Cc4ccccc4)O[C@]1(C[C@@H](C)[C@]1(O3)[C@]3([H])C=C(C)C(=O)[C@@]3(O)CC(COC(=O)Cc3ccc(O)c(OC)c3)=C[C@@]21[H])C(C)=C
: