Target
Transient receptor potential cation channel subfamily V member 1
Ligand
BDBM20344
Substrate
BDBM10852
Meas. Tech.
Ca2+ Influx Functional Assay for the Determination of in Vitro Activity.
pH
7.4±n/a
Temperature
295.15±n/a K
EC50
3.3±0.3 nM
Citation
 Perner, RJDiDomenico, SKoenig, JRGomtsyan, ABayburt, EKSchmidt, RGDrizin, IZheng, GZTurner, SCJinkerson, TBrown, BSKeddy, RGLukin, KMcDonald, HAHonore, PMikusa, JMarsh, KCWetter, JMGeorge, KSJarvis, MFFaltynek, CRLee, CH In vitro structure-activity relationship and in vivo characterization of 1-(aryl)-3-(4-(amino)benzyl)urea transient receptor potential vanilloid 1 antagonists. J Med Chem 50:3651-60 (2007)  
Target
Name:
Transient receptor potential cation channel subfamily V member 1
Synonyms:
Capsaicin receptor Osm-9-like TRP channel 1 TRPV1_HUMAN Transient receptor potential cation channel subfamily V member 1 (TRPV1) Transient receptor potential cation channel subfamily V member 1(TRPV1) Vanilloid VR1 Vanilloid receptor 1 Vanilloid receptor 1 (VRI/TRPV1)
Type:
Protein
Mol. Mass.:
94960.75
Organism:
Homo sapiens (Human)
Description:
Q8NER1
Residue:
839
  
Inhibitor
Name:
BDBM20344
Synonyms:
3-({4-[(1R,5S)-8-azabicyclo[3.2.1]octan-8-yl]phenyl}methyl)-1-isoquinolin-5-ylurea | Isoquinoline Analogue, 38
Type:
Small organic molecule
Emp. Form.:
C24H26N4O
Mol. Mass.:
386.4894
SMILES:
O=C(NCc1ccc(cc1)N1[C@H]2CC[C@@H]1CCC2)Nc1cccc2cnccc12
:
Substrate