Target
RAC-alpha serine/threonine-protein kinase
Ligand
BDBM364983
Substrate
Meas. Tech.
Enzyme Assay
IC50
5.5±n/a nM
Citation
 Lan, RChen, XXiao, YHuck, BRGoutopoulos, A Heterocycles as modulators of kinase activity US Patent  US9867826 Publication Date 1/16/2018 
Target
Name:
RAC-alpha serine/threonine-protein kinase
Synonyms:
AKT phosphorylation (p-AKT) AKT1/PPP1CA C-AKT PKB alpha Protein kinase B Protein kinase B (Akt 1) Protein kinase B alpha Proto-oncogene Akt (Akt1) Proto-oncogene c-Akt (AKT1) RAC-PK-alpha RAC-alpha serine/threonine-protein kinase (AKT1) | RAC-alpha serine/threonine-protein kinase (pAKT)
Type:
Enzyme
Mol. Mass.:
55681.25
Organism:
Homo sapiens (Human)
Description:
P31749
Residue:
480
  
Inhibitor
Name:
BDBM364983
Synonyms:
5-chloro-6-{3,4-cis-4-[1-(2-dimethylamino-ethyl)-4-(4-fluoro-3-methyl-phenyl)-1H-imidazol-2-yl]-3-fluoro-piperidin-1-yl}-pyrimidin-4-ylamine | US9867826, Compound 12
Type:
Small organic molecule
Emp. Form.:
C23H28ClF2N7
Mol. Mass.:
475.965
SMILES:
CN(C)CCn1cc(nc1[C@H]1CCN(C[C@H]1F)c1ncnc(N)c1Cl)-c1ccc(F)c(C)c1
: