Target
Tyrosine-protein kinase JAK1
Ligand
BDBM246880
Substrate
Meas. Tech.
JAK1 Assay
IC50
<10±0 nM
Citation
 Li, YBurns, DMFeng, HGlenn, JHe, CHuang, TMei, SPan, JWang, XYe, Y Pyrrolopyrimidine derivatives as TAM inhibitors US Patent  US10053465 Publication Date 8/21/2018 
Target
Name:
Tyrosine-protein kinase JAK1
Synonyms:
JAK-1 JAK1A JAK1_HUMAN Janus kinase 1 (JAK1) | Janus kinase 1 JAK1
Type:
Protein
Mol. Mass.:
133293.73
Organism:
Homo sapiens (Human)
Description:
P23458
Residue:
1154
  
Inhibitor
Name:
BDBM246880
Synonyms:
US10053465, 19 US10125150, Example 19 US10479803, Example 19 US10675284, Example 19 US11130767, # 19 US11304949, Compound 19 US11406640, Comp. No. 19 US9732097, Example 19 | {1-(cis-4-{[4- [(ethylamino) methyl]-6- (trifluoromethyl) pyridin-2- yl]oxy}cyclohexyl)- 3-[4-(7H-pyrrolo[2,3- d]pyrimidin-4-yl)- 1H-pyrazol-1- yl]azetidin-3- yl}acetonitrile
Type:
Small organic molecule
Emp. Form.:
C29H32F3N9O
Mol. Mass.:
579.6193
SMILES:
CCNCc1cc(O[C@H]2CC[C@H](CC2)N2CC(CC#N)(C2)n2cc(cn2)-c2ncnc3[nH]ccc23)nc(c1)C(F)(F)F
: