Target
Phosphatidylinositol 4,5-bisphosphate 3-kinase catalytic subunit delta isoform
Ligand
BDBM246893
Substrate
Meas. Tech.
PI3K Delta Assay
IC50
<50±0 nM
Citation
 Li, YBurns, DMFeng, HGlenn, JHe, CHuang, TMei, SPan, JWang, XYe, Y Pyrrolopyrimidine derivatives as TAM inhibitors US Patent  US10053465 Publication Date 8/21/2018 
Target
Name:
Phosphatidylinositol 4,5-bisphosphate 3-kinase catalytic subunit delta isoform
Synonyms:
PI3-kinase p110 subunit delta PI3-kinase subunit p110-delta PIK3CD Phosphatidylinositol 4,5-biphosphate 3-kinase catalytic subunit delta (PIK3CD) Phosphatidylinositol 4,5-bisphosphate 3-kinase 110 kDa catalytic subunit delta (PI3K delta) Phosphatidylinositol 4,5-bisphosphate 3-kinase catalytic subunit delta (PI3Kdelta) Phosphatidylinositol 4,5-bisphosphate 3-kinase catalytic subunit delta isoform (PI3K delta) Phosphatidylinositol 4,5-bisphosphate 3-kinase catalytic subunit delta isoform (PI3K-delta) Phosphatidylinositol 4,5-bisphosphate 3-kinase catalytic subunit delta isoform (PI3Kdelta)
Type:
Enzyme Subunit
Mol. Mass.:
119489.41
Organism:
Homo sapiens (Human)
Description:
O00329
Residue:
1044
  
Inhibitor
Name:
BDBM246893
Synonyms:
5-{3-[1-(4-amino-3- methyl-1H-pyrazolo[3,4 d]pyrimidin-1-yl)ethyl]- 6-cyano-2-ethoxy-5- methylphenyl}-N,N- dimethylpyridine-2- carboxamide US10065963, Compound 31 US10519163, Example 31 US10675284, Example 31 US11433071, Example 314-2 | US9730939, Example 314
Type:
Small organic molecule
Emp. Form.:
C26H28N8O2
Mol. Mass.:
484.5529
SMILES:
CCOc1c(cc(C)c(C#N)c1-c1ccc(nc1)C(=O)N(C)C)C(C)n1nc(C)c2c(N)ncnc12
: