Target
Tyrosine-protein kinase Mer
Ligand
BDBM246872
Substrate
Meas. Tech.
TAM Kinase Assay
Temperature
298.15±n/a K
IC50
<500±n/a nM
Comments
extracted
Citation
 Li, YBurns, DMFeng, HGlenn, JHe, CHuang, TMei, SPan, JWang, XYe, Y Pyrrolopyrimidine derivatives as TAM inhibitors US Patent  US10053465 Publication Date 8/21/2018 
Target
Name:
Tyrosine-protein kinase Mer
Synonyms:
MER MERTK Proto-oncogene c-Mer Receptor tyrosine kinase MerTK | Tyrosine-protein kinase Mer
Type:
PROTEIN
Mol. Mass.:
110234.77
Organism:
Homo sapiens (Human)
Description:
ChEMBL_1498723
Residue:
999
  
Inhibitor
Name:
BDBM246872
Synonyms:
US10053465, 11 US10125150, Example 11 US10479803, Example 11 US10675284, Example 11 US11130767, # 11 US11304949, Compound 11 US11406640, Comp. No. 11 US9732097, Example 11 | {trans-3-(4-{[4-[(3- hydroxyazetidin-1- yl)methyl]-6- (trifluoromethyl) pyridin-2- yl]oxy}piperidin-1- yl)-1-[4-(7H- pyrrolo[2,3- d]pyrimidin-4-yl)- 1H-pyrazol-1- yl]cydobutyl} acetonitrile
Type:
Small organic molecule
Emp. Form.:
C30H32F3N9O2
Mol. Mass.:
607.6294
SMILES:
OC1CN(Cc2cc(OC3CCN(CC3)[C@H]3C[C@@](CC#N)(C3)n3cc(cn3)-c3ncnc4[nH]ccc34)nc(c2)C(F)(F)F)C1
: