Target
Tyrosine-protein kinase Mer
Ligand
BDBM246888
Substrate
Meas. Tech.
TAM Kinase Assay
Temperature
298.15±n/a K
IC50
750±n/a nM
Comments
extracted
Citation
 Li, YBurns, DMFeng, HGlenn, JHe, CHuang, TMei, SPan, JWang, XYe, Y Pyrrolopyrimidine derivatives as TAM inhibitors US Patent  US10053465 Publication Date 8/21/2018 
Target
Name:
Tyrosine-protein kinase Mer
Synonyms:
MER MERTK Proto-oncogene c-Mer Receptor tyrosine kinase MerTK | Tyrosine-protein kinase Mer
Type:
PROTEIN
Mol. Mass.:
110234.77
Organism:
Homo sapiens (Human)
Description:
ChEMBL_1498723
Residue:
999
  
Inhibitor
Name:
BDBM246888
Synonyms:
US10053465, 26 US10125150, Example 26 US10479803, Example 26 US11084822, Example 26 US11136326, Example 26 US11324749, Comp. No. 26 US11596632, Comp. No. 26 trans-3-(4-{[4-(2- hydroxyethyl)-6- (trifluoromethyl) pyridin-2- yl]oxy}piperidin-1- yl)-1-[4-(7H- pyrrolo[2,3- d]pyrimidin-4-yl)- 1H-pyrazol-1- yl]cyclobutyl} acetonitrile
Type:
Small organic molecule
Emp. Form.:
C28H29F3N8O2
Mol. Mass.:
566.5775
SMILES:
OCCc1cc(OC2CCN(CC2)[C@H]2C[C@@](CC#N)(C2)n2cc(cn2)-c2ncnc3[nH]ccc23)nc(c1)C(F)(F)F
: