Target
Transient receptor potential cation channel subfamily V member 1
Ligand
BDBM20491
Substrate
BDBM10852
Meas. Tech.
FLIPR (Fluorescence Imaging Plate Reader)-Based Ca2+ Assay
pH
7.2±n/a
Temperature
298.15±n/a K
EC50
40±n/a nM
Citation
 Rami, HKThompson, MStemp, GFell, SJerman, JCStevens, AJSmart, DSargent, BSanderson, DRandall, ADGunthorpe, MJDavis, JB Discovery of SB-705498: a potent, selective and orally bioavailable TRPV1 antagonist suitable for clinical development. Bioorg Med Chem Lett 16:3287-91 (2006)  
Target
Name:
Transient receptor potential cation channel subfamily V member 1
Synonyms:
Capsaicin receptor Osm-9-like TRP channel 1 TRPV1_HUMAN Transient receptor potential cation channel subfamily V member 1 (TRPV1) Transient receptor potential cation channel subfamily V member 1(TRPV1) Vanilloid VR1 Vanilloid receptor 1 Vanilloid receptor 1 (VRI/TRPV1)
Type:
Protein
Mol. Mass.:
94960.75
Organism:
Homo sapiens (Human)
Description:
Q8NER1
Residue:
839
  
Inhibitor
Name:
BDBM20491
Synonyms:
1-(2-bromophenyl)-3-[2-(4-methyl-2,3-dihydro-1H-indol-1-yl)ethyl]urea | dihydroindole derivative, 2
Type:
Small organic molecule
Emp. Form.:
C18H20BrN3O
Mol. Mass.:
374.275
SMILES:
Cc1cccc2N(CCNC(=O)Nc3ccccc3Br)CCc12
:
Substrate