Target
Mitogen-activated protein kinase 1
Ligand
BDBM365098
Substrate
Meas. Tech.
Enzymatic Assay
IC50
<0.020±n/a nM
Citation
 Kolesnikov, ADo, S Serine/threonine kinase inhibitors US Patent  US9867833 Publication Date 1/16/2018 
Target
Name:
Mitogen-activated protein kinase 1
Synonyms:
ERK2 Extracellular signal-regulated kinase 2 Extracellular signal-regulated kinase 2 (ERK2) MAPK 2 MK01_HUMAN Mitogen-activated protein kinase 1 (ERK-2) Mitogen-activated protein kinase 2 PRKM2 | p42-MAPK
Type:
Ser/Thr Protein Kinase
Mol. Mass.:
41392.76
Organism:
Homo sapiens (Human)
Description:
P28482
Residue:
360
  
Inhibitor
Name:
BDBM365098
Synonyms:
4-(9-((4-chloro-1H-pyrazol-1- yl)methyl)-8,9-dihydro-7H-6- oxa-1,2,2a1- triazabenzo[cd]azulen-4-yl)- N-(1-methyl-1H-pyrazol-5- yl)pyridin-2-amine US9867833, Compound I-47(R)
Type:
Small organic molecule
Emp. Form.:
C22H20ClN9O
Mol. Mass.:
461.907
SMILES:
Cn1nccc1Nc1cc(ccn1)-c1cc2OCC[C@@H](Cn3cc(Cl)cn3)c3nnc(c1)n23
: